SWARM-STR
type: Concept
change note: 2021-06-23 10:58:19.0 [mmorahan] Insert Concept add broader relation (SWARM-STR [18919103-a3e9-4c28-a5cb-81c76e3baeaa,649580] - Radar Altimeters [92ddaaca-40b2-4936-bc1a-28cc5743e8b8,641783]);
change note: 2021-06-23 11:02:31.0 [mmorahan] insert AltLabel (id: null category: primary text: Swarm Star Tracker language code: en); insert AltLabel (id: null category: null text: Start Tracker language code: en); insert Definition (id: null text: The Swarm STR (Star Tracker) assembly provides the attitude of the VFM. Both instruments are co-mounted in a common optical bench to ensure proper alignment for the determination of the highly accurate magnetic field components. language code: en); insert WeightedRelation (id: null related concept uuid: 054787a6-0c47-43af-a4ee-05c572dd1705 relationship type: null relationship value: null generated by: null); insert WeightedRelation (id: null related concept uuid: ab7f9a64-ca5d-4795-94ff-fd5367d39f9f relationship type: null relationship value: null generated by: null); insert WeightedRelation (id: null related concept uuid: 769a52d4-7db1-4b8e-8d39-6fee4e74d34f relationship type: null relationship value: null generated by: null); insert WeightedRelation (id: null related concept uuid: 1d6d5f82-acd5-4bd2-9324-12884718b353 relationship type: null relationship value: null generated by: null);
alternative label: Start Tracker
in scheme: instruments
definition: The Swarm STR (Star Tracker) assembly provides the attitude of the VFM. Both instruments are co-mounted in a common optical bench to ensure proper alignment for the determination of the highly accurate magnetic field components.

Radar Altimeters
type: Concept