Surface
type: Concept

AIRBOAT
type: Concept
change note: 2022-02-22 14:41:34.0 [tstevens] insert Definition (id: null text: A flat-bottomed watercraft propelled by an aircraft-type propeller and powered by either an aircraft or automotive engine. language code: en);
change note: 2021-11-18 09:32:44.0 [tstevens] Move Concepts delete broader relation (null); add broader relation (AIRBOAT [18d0b454-a951-4d21-a58a-b984deade210,826019] - Surface [59b97a6c-385e-40a2-8422-ecbdb6023c4c,835900]);
in scheme: platforms
definition: A flat-bottomed watercraft propelled by an aircraft-type propeller and powered by either an aircraft or automotive engine.