COASTLINE
type: Concept
change note: 2020-01-15 08:03:32.0 [tstevens] Insert Concept add broader relation (COASTLINE [18d136b8-728f-438b-90cb-3c82956e1c2c,559663] - GLACIERS/ICE SHEETS [099ab1ae-f4d2-48cc-be2f-86bd58ffc4ca,84281]);
in scheme: sciencekeywords
definition: The actual contour of the continent with the existing ice shelves.

GLACIERS/ICE SHEETS
type: Concept