CLARKSON/CEE
type: Concept
in scheme: providers
definition: The mission of the Department of Civil and Environmental Engineering at Clarkson University is to educate talented and motivated men and women to become successful professionals through quality undergraduate and graduate programs that place a high priority on student access and interaction with faculty. Faculty members within the department are currently directing research on such topics as: -applied limnology and aquatic systems -hydraulics and hydrology -cold regions engineering -environmental engineering -geotechnical engineering -flood forecasting and control -groundwater contamination -hazardous waste engineering -structural engineering and design -water supply and treatment Website: "http://www.clarkson.edu/cee/" [Summary provided by Clarkson University.]

ACADEMIC
type: Concept