US-MEX
type: Concept
in scheme: projects
definition: The United States-Mexico Data Collection project involves an initiative to provide scientists with spatially referenced demographic data for conducting assessments of human interactions with the environment. The collection consists of the following products: Population Database of Mexico; Urban Place, Time-Series Population Spreadsheet of Mexico; Urban Place Geographic Information System (GIS) of Mexico; GIS of Mexican Localities; GIS Coverage of Mexican States; GIS Coverage of Mexican Municipalities; and Raster-based Coverage of Mexican Population. The Dataset Guide for the Georeferenced Population Data Sets of Mexico presents a detailed discussion of the database and information on how to access it. Project URL: http://sedac.ciesin.columbia.edu/plue/ [Summary provided by SEDAC.]

S - U
type: Concept