TECTONIC LANDFORMS
type: Concept

CALDERA
type: Concept
change note: 2023-03-09 09:24:37.0 [tstevens] update PrefLabel (CALDERA);
change note: 2013-08-16 10:06:20.0 [tbs1979] insert Definition (id: null text: A large circular depression in a volcano. language code: en);
change note: 2013-08-05 13:54:38.0 [tbs1979] Insert Concept add broader relation (CALDRA [1a0e7a60-9c22-40c5-8424-55119b4db743,105379] - TECTONIC LANDFORMS [9673dc0b-89c0-4f0c-b378-f1c8cb267c8f,105291]);
in scheme: sciencekeywords
definition: A large circular depression in a volcano.