SATURATION VAPOR PRESSURE
type: Concept
change note: 2017-04-21 13:20:42.0 [sritz] insert Definition (id: null text: The vapor pressure of a system, at a given temperature, for which the vapor of a substance is in equilibrium with a plane surface of that substance's pure liquid or solid phase; that is, the vapor pressure of a system that has attained saturation but not supersaturation. language code: en);
change note: 2017-04-20 14:17:39.0 [sritz] Insert Concept add broader relation (SATURATION VAPOR PRESSURE [1a2332d9-fd69-4002-89a5-203d748a4e21,278829] - WATER VAPOR INDICATORS [005d192a-95b9-4fc2-afed-f87da3c3dc33,278815]);
in scheme: sciencekeywords
definition: The vapor pressure of a system, at a given temperature, for which the vapor of a substance is in equilibrium with a plane surface of that substance's pure liquid or solid phase; that is, the vapor pressure of a system that has attained saturation but not supersaturation.

WATER VAPOR INDICATORS
type: Concept