SALAMANDERS
type: Concept
change note: 2017-03-15 09:42:45.0 [mgenazzi] Definition added insert Definition (id: null text: Phylum Chordata. Class Amphibia. Salamanders have elongated cylindrical bodies and distinguished by presence of a tail in all life stages, limbs are right angles. language code: en);
in scheme: sciencekeywords
definition: Phylum Chordata. Class Amphibia. Salamanders have elongated cylindrical bodies and distinguished by presence of a tail in all life stages, limbs are right angles.

AMPHIBIANS
type: Concept