COMPOSITION/STRUCTURE
type: Concept
change note: 2013-03-13 14:42:18.0 [tbs1979] insert Definition (id: null text: An analysis of the composition and structure of metals. language code: en);
change note: 2013-03-07 08:28:11.0 [tbs1979] Insert Concept add broader relation (COMPOSITION/STRUCTURE [1afa91ea-2b60-48d6-b065-093cd20408cd,83119] - METALS PHYSICAL/OPTICAL PROPERTIES [85d46af8-f6ce-490d-a971-0f03b301c1e4,83117]);
in scheme: sciencekeywords
definition: An analysis of the composition and structure of metals.

METALS PHYSICAL/OPTICAL PROPERTIES
type: Concept