USDA/ARS/BARC/ANRI
type: Concept
in scheme: providers
definition: The mission of the USDA Animal and Natural Resources Institite (ANRI) is to conduct research and to develop technology transfer programs that ensure high quality and safe food while protecting the natural resource base and the environment. Website: "http://www.anri.barc.usda.gov/" [Summary provided by the USDA.]

USDA
type: Concept