VA/VDGIF/WDD
type: Concept
in scheme: providers
definition: The Virginia Department of Game and Inland Fisheries strive to manage Virginia's wildlife and inland fish to maintain optimum populations of all species to serve the needs of the Commonwealth; to provide opportunity for all to enjoy wildlife, inland fish, boating and related outdoor recreation; to promote safety for persons and property in connection with boating, hunting and fishing. Website: http://www.dgif.state.va.us/wildlife/ [Summary provided by the Virginia Department of Game and Inland Fisheries.]

VIRGINIA
type: Concept