SURFACE WATER CHEMISTRY
type: Concept
in scheme: sciencekeywords
definition: Refers to the chemical composition of the surface water of rivers, lakes, streams, and reservoirs including water quality and contamination.

SURFACE WATER
type: Concept