Earth Observation Satellites
type: Concept

SEASAT 1
type: Concept
in scheme: platforms
change note: 2021-11-18 13:46:46.0 [tstevens] Move Concepts delete broader relation (null); add broader relation (SEASAT 1 [1bffe898-f4a2-458e-92c5-cd7c9c1cd5f0,826033] - Earth Observation Satellites [3466eed1-2fbb-49bf-ab0b-dc08731d502b,826121]);
change note: 2021-11-18 12:43:06.0 [tstevens] Move Concepts delete broader relation (null); add broader relation (SEASAT 1 [1bffe898-f4a2-458e-92c5-cd7c9c1cd5f0,826033] - Space-based Platforms [b39a69b4-c3b9-4a94-b296-bbbbe5e4c847,835875]);
change note: 2016-06-09 13:18:23.0 [epneff] added altLabel insert AltLabel (id: null text: SEASAT-1 language code: en);
definition: [Source NASA Space Science Data Center, http://nssdc.gsfc.nasa.gov/nmc/spacecraftDisplay.do?id=1978-064A ] The Ocean Dynamics Satellite (Seasat 1) was designed to provide measurements of sea-surface winds, sea-surface temperatures, wave heights, internal waves, atmospheric liquid water content, sea ice features, ocean features, ocean topography, and the marine geoid. Seasat 1 provided 95% global coverage every 36 h. The instrument payload consisted of (1) an X-band compressed pulse radar altimeter (ALT), (2) a coherent synthetic aperture radar (SAR), (3) a Seasat-A scatterometer system (SASS), (4) a scanning multichannel microwave radiometer (SMMR), and (5) a visible and infrared radiometer (VIRR). The accuracies obtained were distance between spacecraft and ocean surface to 10 cm, wind speeds to 2 m/s, and surface temperatures to 1 deg C. For more information about Seasat 1, see "Seasat mission overview," Science, v. 204, pp. 1405-1424, 1979, and a special issue on the Seasat 1 sensors, IEEE J. of Oceanic Eng., v. OE-5, 1980. On October 10, 1978, Seasat 1 failed due to a massive short circuit in its electrical system. During most of its 105 days in orbit, Seasat 1 returned a unique and extensive set of observations of the earth's oceans. Group: Platform_Details Entry_ID: SEASAT 1 Group: Platform_Identification Platform_Category: Earth Observation Satellites Short_Name: SEASAT 1 Long_Name: Ocean Dynamics Satellite End_Group Group: Synonymous_Platform_Names Short_Name: Seasat-A Short_Name: 10967 End_Group Group: Platform_Associated_Instruments Short_Name: LT (SEASAT 1) Short_Name: VIRR Short_Name: SMMR Short_Name: SASS Short_Name: SAR Short_Name: ALT End_Group Group: Orbit Orbit_Inclination: 108.0° Period: 100.7 minutes Perigee: 769.0 km Apogee: 799.0 km End_Group Creation_Date: 2009-02-27 Online_Resource: http://southport.jpl.nasa.gov/scienceapps/seasat.html Online_Resource: http://nssdc.gsfc.nasa.gov/nmc/spacecraftDisplay.do?id=1978-064A Online_Resource: http://nas…
alternative label: SEASAT-1