J - L
type: Concept

JAX90
type: Concept
change note: 2016-06-15 11:47:01.0 [gee-cee] insert Definition (id: null text: The Jacksonville 90 (JAX90) field experiment was conducted during the month of October 1990 over the Gulf of Mexico. These early validation flights collected initial flight data from AMPR, which were then used to develop algorithms relating brightness temperatures observed at different wavelengths to precipitation characteristics. language code: en);
change note: 2016-06-15 11:46:39.0 [gee-cee] Insert Concept add broader relation (JAX90 [1c36cf52-11ea-47f4-b987-9053c3f2604e,188291] - J - L [996e8a4b-e690-4a9c-afcf-205fff95b38b,173693]);
in scheme: projects
definition: The Jacksonville 90 (JAX90) field experiment was conducted during the month of October 1990 over the Gulf of Mexico. These early validation flights collected initial flight data from AMPR, which were then used to develop algorithms relating brightness temperatures observed at different wavelengths to precipitation characteristics.