Surface
type: Concept

R/V LMG
type: Concept
change note: 2021-11-18 09:27:25.0 [tstevens] Move Concepts delete broader relation (null); add broader relation (R/V LMG [1c4e4aa2-b801-479f-b814-c18201db0960,826035] - Surface [59b97a6c-385e-40a2-8422-ecbdb6023c4c,835900]);
in scheme: platforms
definition: [Adapted from "R/V Laurence M. Gould", "http://www.nsf.gov/od/opp/support/gould.htm"] The R/V Laurence M.Gould is 76 meters in length, and is ice-strengthened (Ice class ABS A1). The Gould, a multi-disciplinary research platform, is designed for year-round polar operations and can accomodate 26 research scientists for missions up to 75 days long. Its primary mission is to support research in the Antarctic Peninsula region and to resupply and transport researchers and staff between Palmer Station and South American ports.