IOMICS
type: Concept
change note: 2013-12-12 15:33:38.0 [gee-cee] insert AltLabel (id: null text: Indian Ocean Moored Buoy Network Initiative for Climate Studies language code: en);
change note: 2013-12-12 15:33:01.0 [gee-cee] Insert Concept add broader relation (IOMICS [1cc34eef-fda5-4517-aca2-6ebd48d289a4,106017] - G - I [af0968ce-ffe3-44a0-86de-2ec9b9a8fa5d,77509]);
in scheme: projects
definition: The program will enable the development of a new small size TRITON buoy and the continuation of the present TRITON sites in the Indian Ocean.

G - I
type: Concept