NASA/JPL/OPERA
type: Concept
definition: JPL, along with project partners from NASA’s Goddard Space Flight Center, the U.S. Geological Survey (USGS), the University of Maryland College Park, the University of Alaska Fairbanks, and Southern Methodist University, are developing and implementing a near-global Surface Water Extent product derived from Optical and SAR data; a near-global Disturbance product from Optical data; and a North America* Displacement product from SAR data. Near-global corresponds to all land-masses excluding Antarctica. North America* corresponds to the United States (USA) and U.S. Territories, parts of Canada within 200 km of the U.S. border, and all mainland countries from the southern US border up to and including Panama.
change note: 2023-07-31 14:14:13.0 [sritz] insert Definition (id: null text: JPL, along with project partners from NASA’s Goddard Space Flight Center, the U.S. Geological Survey (USGS), the University of Maryland College Park, the University of Alaska Fairbanks, and Southern Methodist University, are developing and implementing a near-global Surface Water Extent product derived from Optical and SAR data; a near-global Disturbance product from Optical data; and a North America* Displacement product from SAR data. Near-global corresponds to all land-masses excluding Antarctica. North America* corresponds to the United States (USA) and U.S. Territories, parts of Canada within 200 km of the U.S. border, and all mainland countries from the southern US border up to and including Panama. language code: en);
change note: 2023-07-31 13:56:54.0 [sritz] Insert Concept add broader relation (NASA/JPL/OPERA [1cdb9dc2-b912-49a9-ba44-aaf62fa77242,1395066] - NASA [4fd0aa9d-1a80-4dde-8452-c69b5c4d08cc,1380986]);
change note: 2023-07-31 13:58:26.0 [sritz] insert AltLabel (id: null category: primary text: Observational Products for End-Users from Remote Sensing Analysis, Jet Propulsion Laboratory, NASA language code: en);
in scheme: providers

NASA
type: Concept