UMD Cessna
type: Concept
change note: 2021-11-17 13:23:49.0 [tstevens] Move Concepts delete broader relation (null); add broader relation (UMD Cessna [1d0fbb34-9f52-41cc-8b83-b45af8e58777,826039] - Propeller [6175c78e-432c-4254-b442-40d3cf0f6b34,835882]);
change note: 2020-08-12 15:14:09.0 [sritz] insert AltLabel (id: null category: primary text: University Of Maryland Cessna 402B Research Aircraft language code: en); insert Definition (id: null text: The University Of Maryland Cessna 402B Research Aircraft. language code: en);
change note: 2020-08-12 15:12:24.0 [sritz] Insert Concept add broader relation (UMD Cessna [1d0fbb34-9f52-41cc-8b83-b45af8e58777,560592] - Aircraft [227d9c3d-f631-402d-84ed-b8c5a562fc27,541399]);
in scheme: platforms
definition: The University Of Maryland Cessna 402B Research Aircraft.

Propeller
type: Concept