NSF
type: Concept

LTER/GCE
type: Concept
change note: 2018-07-05 14:00:05.0 [sritz] update Definition (The Georgia Coastal Ecosystems LTER Project involves studying the role of water transport in the ecological linkages between upland areas and the coastal zone in central Georgia. Website: http://gce-lter.marsci.uga.edu); update Definition (Summary provided by Georgia LTER); update Resource (provider); update Resource (http://gce-lter.marsci.uga.edu/);
in scheme: providers
definition: The Georgia Coastal Ecosystems LTER Project involves studying the role of water transport in the ecological linkages between upland areas and the coastal zone in central Georgia. Website: http://gce-lter.marsci.uga.edu