ANIMAL COMMODITIES
type: Concept

LIVESTOCK PRODUCTS
type: Concept
in scheme: sciencekeywords
definition: Any measurement related to livestock commodities (does not include DAIRY or Poultry) including, but not limited to: meat, wool, leather, glue, chemicals (e.g. insulin), and any other edible or none edible products from beef cattle, swine, sheep, horses, and goats.