GROSS PRIMARY PRODUCTION (GPP)
type: Concept

SOIL PRODUCTIVITY
type: Concept
change note: 2020-01-17 19:21:28.0 [sritz] Insert Concept add narrower relation (SOIL PRODUCTIVITY [1e7afff2-cd50-4d26-968b-bffd2d738edd,84119] - GROSS PRIMARY PRODUCTION (GPP) [283df7dc-58e0-41c5-80b1-e9cdeae9e79e,559697]);
change note: 2017-03-10 09:20:31.0 [tstevens] update Definition (The capacity of a soil for producing a specified plant or sequence of plants under a specified system of management; emphasizing the ability to produce crops.); update Definition (The Nature and Properties of Soils, Prentice Hall, 1996. );
in scheme: sciencekeywords
definition: The capacity of a soil for producing a specified plant or sequence of plants under a specified system of management; emphasizing the ability to produce crops.

SOILS
type: Concept