CA/NFLD/TCR/PAO
type: Concept
in scheme: providers
definition: The Provincial Archaeology Office (PAO), of the Culture and Heritage Division, Department of Tourism, Culture and Recreation, is the regulatory agency for all archaeology conducted within the Province of Newfoundland and Labrador. It is responsible for several areas, including Archaeological Site Management, Archaeological Permitting, Review of Land Use Applications, Development of Policy and Procedures, Consultation with Various Groups having Archaeological Interests, and Education. Website: "http://www.nfmuseum.com/pao.htm" [Summary provided by Newfoundland Department of Tourism, Culture and Recreation - Culture and Heritage Division, Provincial Archaeology Office]

CANADA
type: Concept