WHOI
type: Concept
change note: 2018-03-13 07:48:40.0 [tstevens] insert AltLabel (id: null category: primary text: WOODS HOLE OCEANOGRAPHIC INSTITUTION language code: en); insert Definition (id: null text: The Woods Hole Oceanographic Institution is dedicated to advancing knowledge of the ocean and its connection with the Earth system through a sustained commitment to excellence in science, engineering, and education, and to the application of this knowledge to problems facing society. language code: en); insert Resource (id: null type: provider url: http://www.whoi.edu/);
change note: 2018-03-13 07:47:18.0 [tstevens] Insert Concept add broader relation (WHOI [1fb3e61a-c0b3-4118-ad19-97fc26b0243c,310783] - CONSORTIA/INSTITUTIONS [aef2fc80-def0-46a4-9259-9dc37e80ed08,280053]);
in scheme: providers
definition: The Woods Hole Oceanographic Institution is dedicated to advancing knowledge of the ocean and its connection with the Earth system through a sustained commitment to excellence in science, engineering, and education, and to the application of this knowledge to problems facing society.

CONSORTIA/INSTITUTIONS
type: Concept