CALIFORNIA
type: Concept

CA/DWR
type: Concept
change note: 2018-11-02 15:29:53.0 [sritz] update Definition (The mission of the California Department of Water Resources is to manage the water resources of California in cooperation with other agencies, to benefit the State's people, and to protect, restore, and enhance the natural and human environments. https://water.ca.gov/ [Summary provided by the California Department of Water Resources]); update Resource (provider); update Resource (https://water.ca.gov/);
in scheme: providers
definition: The mission of the California Department of Water Resources is to manage the water resources of California in cooperation with other agencies, to benefit the State's people, and to protect, restore, and enhance the natural and human environments. https://water.ca.gov/ [Summary provided by the California Department of Water Resources]