ENVIRONMENTAL IMPACTS
type: Concept

MINE DRAINAGE
type: Concept
change note: 2012-06-29 14:44:50.0 [tbs1979] update Definition (Chiras, Daniel D. 1998. Environmental Science. A Systems Approach to Sustainable Development. Wadsworth Publishing Company. Belmont, California. ); update Definition (Mine drainage, also known as acid mine drainage, is sulfuric acid that drains from mines, especially abandoned underground coal mines such as in the Eastern United States.);
in scheme: sciencekeywords
definition: Mine drainage, also known as acid mine drainage, is sulfuric acid that drains from mines, especially abandoned underground coal mines such as in the Eastern United States.