TEMPO
type: Concept
change note: 2022-03-23 08:50:58.0 [tstevens] insert AltLabel (id: null category: primary text: Tropospheric Emissions: Monitoring of Pollution language code: en); insert Definition (id: null text: The TEMPO instrument is a grating spectrometer, sensitive to visible and ultraviolet wavelengths of light, which will be attached to the Earth-facing side of a commercial telecommunications satellite (to be selected) in geostationary orbit. This allows TEMPO to maintain a constant view of North America so that the instrument's light-collecting mirror can make a complete East to West scan of the "Field of Regard" each and every hour of the day. By measuring sunlight reflected and scattered from the Earth's surface and atmosphere back to the instrument's detectors, TEMPO's ultraviolet and visible light sensors will provide spectra of ozone, nitrogen dioxide, and other elements of daily atmospheric chemistry cycles. language code: en);
change note: 2022-03-23 08:49:40.0 [tstevens] Insert Concept add broader relation (TEMPO [20b24a77-036d-46d0-9d3d-34dc924586cf,865212] - Spectrometers [055a79c7-61db-4250-abad-f1e09909f14c,856211]);
in scheme: instruments
definition: The TEMPO instrument is a grating spectrometer, sensitive to visible and ultraviolet wavelengths of light, which will be attached to the Earth-facing side of a commercial telecommunications satellite (to be selected) in geostationary orbit. This allows TEMPO to maintain a constant view of North America so that the instrument's light-collecting mirror can make a complete East to West scan of the "Field of Regard" each and every hour of the day. By measuring sunlight reflected and scattered from the Earth's surface and atmosphere back to the instrument's detectors, TEMPO's ultraviolet and visible light sensors will provide spectra of ozone, nitrogen dioxide, and other elements of daily atmospheric chemistry cycles.

Spectrometers
type: Concept