ERM
type: Concept
in scheme: instruments
definition: Earth's radiation detector is mainly used for detecting the Earth-atmosphere system radiation budget.It does this by 0.2-4.3 µm short wave and 0.2-50 µm full wave the two wide bands channel observation of the Earth system radiation into space, where the main observations of short wave channel gas system reflection of solar radiation, from the full wave channel observation will be deducted reflection of solar radiation is the result of the Earth-atmosphere system-wave radiation.The adoption of the Earth's radiation detector wide-angle sweeping across the narrow field of view and track scan modes on Earth observation, the former provides the global total of radiation budget status, and the latter provides resolution of about 35Km of the Earth's radiation budget distribution of energy. Narrow field of view scanned channels and the index Channel 0.2～>3.8μm 0.2～50μm Field View 2°×2° 2°×2° Scan area ±50° ±50° Radiance range 0～370Wm-2Sr-1 0～500Wm-2Sr-1 Calibration accuracy[Note 1] 1% 0.8% Sensitivity 0.4Wm-2Sr-1 0.4Wm-2Sr-1 Long-term stability in the second year[Note 2] ＜1% ＜1% Wide field of view does not scan the channel and its index Channel 0.2～>3.8μm 0.2～50μm Field View 120° 120° Scan area ±50° ±50° Radiance range 0～370Wm-2Sr-1 0～500Wm-2Sr-1 Calibration accuracy[Note 1] 1% 0.8% Sensitivity 0.4Wm-2Sr-1 0.4Wm-2Sr-1 Long-term stability in the second year[Note 2] ＜1% ＜1% [Note 1]：for the first Star [Note 2]：assessment of long-term stability in-orbit Group: Instrument_Details Entry_ID: ERM Group: Instrument_Identification Instrument_Category: Earth Remote Sensing Instruments Instrument_Class: Passive Remote Sensing Instrument_Type: Spectrometers/Radiometers Instrument_Subtype: Radiometers Short_Name: ERM Long_Name: Earth Radiation Measurement End_Group Online_Resource: http://satellite.cma.gov.cn/ArssEn/StaticContent/DeviceIntro_FY3_ERM.aspx Creation_Date: 2011-02-01 Group: Instrument_Logistics Instrument_Start_Date: 2008-05-29 Instrument_Owner: China/NSMC End_Group End_Gro…

Radiometers
type: Concept