SPECTROGRAPHS
type: Concept
in scheme: instruments
definition: Spectrographs are spectroscopes with a photographic or other recording device to capture an image of the entire spectrum, or portions thereof, at one instant in time. [Source: Glossary of Meteorology]

Spectrometers
type: Concept