SOLAR ENERGETIC PARTICLE FLUX
type: Concept

ALPHA PARTICLE FLUX
type: Concept
in scheme: sciencekeywords
definition: An alpha particle has positive charge and consists of two protons and two neutrons (the nucleus of a helium atom). Alpha particles can cause ionization of neutral atoms. Flux is the rate of flow through a reference surface, measured in particles per unit area.