Permanent Land Sites
type: Concept

FIXED OBSERVATION STATIONS
type: Concept
in scheme: platforms
change note: 2021-11-17 13:56:39.0 [tstevens] Move Concepts delete broader relation (null); add broader relation (FIXED OBSERVATION STATIONS [2219e7fa-9fd0-443d-ab1b-62d1ccf41a89,826063] - Permanent Land Sites [0ec10fd9-492c-498a-b6d8-e2840cc3643b,835887]);
change note: 2021-07-23 16:37:57.0 [sritz] insert AltLabel (id: null category: primary text: FIXED OBSERVATION STATIONS language code: en);
change note: 2022-02-10 09:07:50.0 [tstevens] update Definition (A fixed, somewhat permanent point from which measurements or surveys are made.); update Definition (The American Heritage Dictionary of the English Language, Fourth Edition Copyright 2000 by Houghton Mifflin Company);
change note: 2022-02-08 12:45:13.0 [tstevens] update Definition (Fixed Observation Stations: A fixed, somewhat permanent point from which measurements or surveys are made.); update Definition (The American Heritage Dictionary of the English Language, Fourth Edition Copyright 2000 by Houghton Mifflin Company);
definition: A fixed, somewhat permanent point from which measurements or surveys are made.