X-RAY TELESCOPE
type: Concept
in scheme: instruments
definition: X-RAY TELESCOPES provide magnification of images of distant objects that uses x-ray (a more detailed and varied telescope).

X-Ray/Gamma Ray Detectors
type: Concept