NASA
type: Concept

NASA/JPL/OCEANESIP
type: Concept
in scheme: providers
definition: The Ocean ESIP is a member of NASA's Earth Science Information Partner (ESIP) Federation. This data center provides improved satellite data products and simulation model output in support of global change studies of the oceans. Global ocean data available on this site: -Sea level from the TOPEX/Poseidon altimeter -Wind and wind stress (QuikScat, NSCAT, ERS-1 and ERS-2 scatterometers) -Sea Surface Temperature (MODIS, NAVOCEANO, AVHRR, MCSST, NCEP/Reynolds) -Barotropic Model along the TOPEX/Poseidon groundtrack Website: "http://oceanesip.jpl.nasa.gov/"