MTU/FOREST
type: Concept
in scheme: providers
definition: As our human population continues to increase, forests and other natural resources are valuable for the serenity they provide and the products they produce. Our challenge is to provide goods and services produced from these resources while maintaining healthy and sustainable ecosystems. Summary Provided By: http://forest.mtu.edu/

ACADEMIC
type: Concept