EXTRATROPICAL CYCLONE MOTION
type: Concept
change note: 2016-06-28 14:37:18.0 [saritz] insert Definition (id: null text: Change in Extratropical Cyclone position with respect to time. language code: en);
change note: 2016-06-28 14:36:58.0 [saritz] Insert Concept add broader relation (EXTRATROPICAL CYCLONE MOTION [2357d9ae-3376-4c4e-8533-6193bf177345,217759] - EXTRATROPICAL CYCLONES [da436e9b-60e5-4a5f-a50a-08794d62bca8,217755]);
in scheme: sciencekeywords
definition: Change in Extratropical Cyclone position with respect to time.

EXTRATROPICAL CYCLONES
type: Concept