ACADEMIC
type: Concept

CLEMSON/AGWX
type: Concept
in scheme: providers
definition: Documents reports sent to the Clemson Agricultural Weather Office by the National Weather Service concerning county weather substations. Information in these reports is recorded at the National Climatic Data Center. Information includes location of recordings, equipment used, and type of recordings at each county weather substation. This information is also available to users through the Clemson University computer systems.