EXHIBIT MATERIALS
type: Concept

MUSEUM EXHIBITS
type: Concept
in scheme: sciencekeywords
definition: Museum Exhibits are defined as Education / Outreach Services that provide a sensory (visual, auditory, tactile, etc.) presentation of items or concepts related to the Earth Sciences and/or Global Environmental Change at a Museum.