SOIL CONSISTENCE
type: Concept
in scheme: sciencekeywords
definition: The combination of properties of soil material that determine its resistance to crushing and its ability to be molded or changed in shape.

SOILS
type: Concept