SURFACE TEMPERATURE
type: Concept

SKIN TEMPERATURE
type: Concept
change note: 2013-10-16 18:46:30.0 [saritz] updated definitions update Definition (EOSDIS Parameter Keyword Definitions, https://earthdata.nasa.gov/about-eosdis); update Definition (Temperature of the top layer of the ice/ocean surface from which thermal radiation emanates.);
change note: 2013-09-04 14:37:01.0 [epneff] Move Concepts delete broader relation (null); add broader relation (SKIN TEMPERATURE [25fcdcb7-efd2-4d2f-ba57-92bbcc7ba69a,85685] - SURFACE TEMPERATURE [5a7bb095-4d12-4232-bc75-b8e82197cb92,86389]);
in scheme: sciencekeywords
definition: Temperature of the top layer of the ice/ocean surface from which thermal radiation emanates.