ANIMAL BREEDING AND GENETICS
type: Concept
in scheme: sciencekeywords
definition: Any measure related to gene mapping, animal species breeding for hybrid or higher value species, breeding for increased production, disease resistance, pest resistance, or related genetic measures.

ANIMAL SCIENCE
type: Concept