NON-GOVERNMENT/NON-PROFIT ORGANIZATIONS
type: Concept

KILLI-DATA
type: Concept
in scheme: providers
definition: Killi-Data online presents all available top quality information on Killies or oviparous Cyprinodont fishes, including a Data Base, * with full ichthyological, ecological and historical coverage of each taxon and, * with all aquarium information for maintenance and breeding for each species and, * with all details of systematics, morphology, genetics, patterns of each species and, * with over 2207 color photos for the 814 valid species (male and female). Summary Provided By: http://www.killi-data.org/