UK/NHM/PAL
type: Concept
change note: 2014-04-30 09:34:46.0 [128.183.164.42] update PrefLabel (UK/NHM/PAL);
in scheme: providers
definition: The Department of Palaeontology currently houses full-time researchers, curators, and support personnel engaged in a wide variety of scientific research and commercial projects that focus on the study of fossils through time. The Department of Palaeontology also houses all of the Museum's on-site palaeontological collections.

UNITED KINGDOM
type: Concept