ACADEMIC
type: Concept

UCONN/EEB
type: Concept
in scheme: providers
definition: We are a vibrant community of ecologists, evolutionary biologists and systematists who teach and conduct research in a diversity of modern and relevant biological disciplines, ranging from the venerable ecology, morphology and systematics to the relatively new evolutionary developmental ("Evo-Devo") biology. Summary Provided By: http://hydrodictyon.eeb.uconn.edu/eebwww/