UMAINE/CE/MSG
type: Concept
in scheme: providers
definition: Welcome to Maine Sea Grant! Our mission is to play a leadership role in marine science and education and to promote their use in the sustainable development, management, and stewardship of marine and coastal resources. Our slogan is “Marine Science for Maine People” and we encourage everyone to contact our staff to discuss ways we can work together. Summary Provided by: http://www.seagrant.umaine.edu/

ACADEMIC
type: Concept