UNC-CHAPEL_HILL/CPC
type: Concept
in scheme: providers
definition: The UNC Carolina Population Center devotes its resources to fostering communication, innovation, and high-quality research. Extensive synergies occur across units to provide efficient, professional support to CPC scholars, trainees, and research staff.

ACADEMIC
type: Concept