IRELAND
type: Concept

IE/MET-EIREANN
type: Concept
in scheme: providers
definition: Met Eireann is the Irish National Meteorological Service and is attached to the Department of the Environment and Local Government. It is the leading provider of weather information and related services for Ireland. Met Eireann's mission is to meet the national requirement for high-quality weather forecasts and associated services, with optimum efficiency and value for money. Website: "http://www.met.ie/" [Summary provided by Met Eireann, The Irish Meteorological Service]