CANADA
type: Concept

CA/MB/WATER
type: Concept
in scheme: providers
definition: The Water Quality Management Section provides services in support of the Department's mission by protecting, maintaining, and where necessary, rehabilitating the quality of Manitoba's aquatic ecosystems. This is done through the application of principals and policies of sustainable development and through the innovative management of risks. The Water Quality Management Section is comprised of six full time professionals, one part time professional, and often several others on term, part-time, or students with expertise in various areas of aquatic ecology, water chemistry, biology, limnology, groundwater hydrogeology, statistical analyses, plus other related disciplines. Summary Provided by: http://www.gov.mb.ca/waterstewardship/water_quality/quality/index.html