SOIL TEMPERATURE PROBE
type: Concept
in scheme: instruments
definition: A SOIL TEMPERATURE PROBE is a device that measures the temperature of the soil at which it is measured at a certain depth, typically 2, 4, 8 and sometimes 20, 40 inches.

Probes
type: Concept