DS
type: Concept
in scheme: providers
definition: Headquartered in Englewood, Colo., Dynamic Solutions International (DSI) is a leading international provider of data storage solutions and comprehensive professional services for mid to large sized organizations. With more than 30 years of expertise and significant engineering resources, DSI is committed to expanding its family of solutions to provide the industry’s most complete solution for protecting critical enterprise data—and preserving our customers’ technology investments. DSI is a privately held company that currently serves more than 2,000 customers worldwide.

COMMERCIAL
type: Concept