Salp_Antarctic
type: Concept
change note: 2015-06-04 12:57:32.0 [gee-cee] Insert Concept add broader relation (Salp_Antarctic [27fc3ee5-600e-4add-82b1-50c3c769571c,158011] - S - U [4eb1894b-35b4-406b-8864-944a42bc7702,148357]);
in scheme: projects
definition: Population ecology of Salpa thompsoni based on molecular indicators. Start Date: 2011-06 End Date: 2014-05 Geolocation: Southern Ocean More Information: http://www.bco-dmo.org/project/2174

S - U
type: Concept