ACADEMIC
type: Concept

USF/ISB
type: Concept
in scheme: providers
definition: The USF Herbarium was established as a research and teaching collection in 1958, two years after the founding of the University of South Florida. The USF Herbarium, with nearly 240,000 specimens, is the second largest collection in Florida, the seventh largest in the southeastern United States, and ranks in the upper third of the world's herbaria in size. Summary Provided By: http://www.plantatlas.usf.edu/isb/herbarium.htm